Not builtConsole Output

[INFO] ------------------------------------------------------------------------
[INFO] Reactor Summary:
[INFO] 
[INFO] EssentialsParent ................................... FAILURE [  1.866 s]
[INFO] Essentials ......................................... SKIPPED
[INFO] EssentialsAntiBuild ................................ SKIPPED
[INFO] EssentialsChat ..................................... SKIPPED
[INFO] EssentialsGeoIP .................................... SKIPPED
[INFO] EssentialsProtect .................................. SKIPPED
[INFO] EssentialsSpawn .................................... SKIPPED
[INFO] EssentialsXMPP ..................................... SKIPPED
[INFO] ------------------------------------------------------------------------
[INFO] BUILD FAILURE
[INFO] ------------------------------------------------------------------------
[INFO] Total time: 2.781 s
[INFO] Finished at: 2018-08-14T05:14:01+00:00
[INFO] Final Memory: 16M/212M
[INFO] ------------------------------------------------------------------------
Waiting for Jenkins to finish collecting data
[ERROR] Failed to execute goal org.apache.maven.plugins:maven-antrun-plugin:1.7:run (default) on project EssentialsParent: An Ant BuildException has occured: The following error occurred while executing this line:
[ERROR] /var/lib/jenkins/jobs/Spigot-Essentials/workspace/EssentialsGroupManager/nbproject/build-impl.xml:926: The following error occurred while executing this line:
[ERROR] /var/lib/jenkins/jobs/Spigot-Essentials/workspace/EssentialsGroupManager/nbproject/build-impl.xml:268: Compile failed; see the compiler error output for details.
[ERROR] around Ant part ...<ant antfile="build.xml" dir="EssentialsGroupManager"/>... @ 5:58 in /var/lib/jenkins/jobs/Spigot-Essentials/workspace/target/antrun/build-buildgm.xml
[ERROR] -> [Help 1]
[ERROR] 
[ERROR] To see the full stack trace of the errors, re-run Maven with the -e switch.
[ERROR] Re-run Maven using the -X switch to enable full debug logging.
[ERROR] 
[ERROR] For more information about the errors and possible solutions, please read the following articles:
[ERROR] [Help 1] http://cwiki.apache.org/confluence/display/MAVEN/MojoExecutionException
Started
Build failed before it gets to this module
Finished: NOT_BUILT