Console Output

Established TCP socket on 38671
<===[JENKINS REMOTING CAPACITY]===>channel started
Executing Maven:  -B -f /var/lib/jenkins/jobs/BuildTools/workspace/pom.xml clean install -Dbuild.number=113
[INFO] Scanning for projects...
[INFO]                                                                         
[INFO] ------------------------------------------------------------------------
[INFO] Building BuildTools 1.0-SNAPSHOT
[INFO] ------------------------------------------------------------------------
[INFO] Downloading: http://repo.maven.apache.org/maven2/net/md-5/scriptus/0.4.1/scriptus-0.4.1.pom
[INFO] ------------------------------------------------------------------------
[INFO] BUILD FAILURE
[INFO] ------------------------------------------------------------------------
[INFO] Total time: 1.210 s
[INFO] Finished at: 2020-06-20T23:43:18+00:00
[INFO] Final Memory: 17M/388M
[INFO] ------------------------------------------------------------------------
Waiting for Jenkins to finish collecting data
[ERROR] Plugin net.md-5:scriptus:0.4.1 or one of its dependencies could not be resolved: Failed to read artifact descriptor for net.md-5:scriptus:jar:0.4.1: Could not transfer artifact net.md-5:scriptus:pom:0.4.1 from/to central (http://repo.maven.apache.org/maven2): Failed to transfer file: http://repo.maven.apache.org/maven2/net/md-5/scriptus/0.4.1/scriptus-0.4.1.pom. Return code is: 501, ReasonPhrase: HTTPS Required. -> [Help 1]
[ERROR] 
[ERROR] To see the full stack trace of the errors, re-run Maven with the -e switch.
[ERROR] Re-run Maven using the -X switch to enable full debug logging.
[ERROR] 
[ERROR] For more information about the errors and possible solutions, please read the following articles:
[ERROR] [Help 1] http://cwiki.apache.org/confluence/display/MAVEN/PluginResolutionException